{"text_format":"1","workbook":"xlsx","n_sheets":6,"sheets":["申込一覧表","申込個人票","選手リスト","学校データ","大会データ","Manual"],"not_rendered":{"charts":0,"images":0,"macros":1,"external_links":0,"defined_names":2,"comments":1,"pivot_tables":0},"unopened":[],"bounds":{"document_bytes":16777216,"sheet_cells":100000,"rows_first":2000,"rows_last":500,"rows_between":2000,"halvings":0,"cell_chars":16384,"cell_head_chars":4096},"cells_cut":0,"cells_raw":0,"read":"whole","date_system":"1900"}

{"sheet":"申込一覧表","index":0,"n_rows":42,"n_cols":20,"rows_kept":42,"cut":false,"hidden":false,"merged":[[3,4,13,4],[12,6,12,9],[12,15,12,16],[12,18,12,19],[13,6,13,9],[13,11,13,14],[13,16,13,19],[11,16,11,18],[0,5,2,10],[0,14,1,19],[2,14,4,19],[4,6,4,11],[6,6,6,12],[6,14,6,18],[19,6,19,10],[19,13,19,14],[19,15,19,16],[19,17,19,19],[20,6,20,10],[20,13,20,14],[20,15,20,16],[20,17,20,19],[17,5,18,5],[17,6,18,10],[17,11,18,11],[17,12,18,12],[17,13,18,14],[17,15,17,19],[18,15,18,16],[18,17,18,19],[23,6,23,10],[23,13,23,14],[23,15,23,16],[23,17,23,19],[24,6,24,10],[24,13,24,14],[24,15,24,16],[24,17,24,19],[21,6,21,10],[21,13,21,14],[21,15,21,16],[21,17,21,19],[22,6,22,10],[22,13,22,14],[22,15,22,16],[22,17,22,19],[27,6,27,10],[27,13,27,14],[27,15,27,16],[27,17,27,19],[28,6,28,10],[28,13,28,14],[28,15,28,16],[28,17,28,19],[25,6,25,10],[25,13,25,14],[25,15,25,16],[25,17,25,19],[26,6,26,10],[26,13,26,14],[26,15,26,16],[26,17,26,19],[31,6,31,10],[31,13,31,14],[31,15,31,16],[31,17,31,19],[32,6,32,10],[32,13,32,14],[32,15,32,16],[32,17,32,19],[29,6,29,10],[29,13,29,14],[29,15,29,16],[29,17,29,19],[30,6,30,10],[30,13,30,14],[30,15,30,16],[30,17,30,19],[37,8,37,9],[37,10,37,11],[37,12,37,13],[33,6,33,10],[33,13,33,14],[33,15,33,16],[33,17,33,19],[35,6,35,7],[35,8,35,9],[35,10,35,11],[35,12,35,13],[35,15,35,17],[41,5,41,6],[41,7,41,12],[41,14,41,19],[7,5,9,5],[7,6,7,7],[8,7,8,18],[9,13,9,19],[11,6,11,8],[11,11,11,13],[12,11,12,13],[37,15,37,17],[38,6,38,7],[38,8,38,9],[38,10,38,11],[38,12,38,13],[39,6,39,7],[39,8,39,9],[39,10,39,11],[39,12,39,13],[36,6,36,7],[36,8,36,9],[36,10,36,11],[36,12,36,13],[37,6,37,7]]}
[null,null,null,null,"No.","⑪申込一覧表",null,null,null,null,null,null,null,null,"大　　　　　　　　会　　　　　　　　名"]
[null,null,null,null,1]
[null,null,null,null,"↑",null,null,null,null,null,null,null,null,null,{"$f":"\"第\"&大会データ!$B$3&\"回東京都中学校スキー大会\"&CHAR(10)&\"第\"&大会データ!$B$4&\"回全国中学校スキー大会\"&CHAR(10)&\"東京都予選会\"","v":"第30回東京都中学校スキー大会\n第55回全国中学校スキー大会\n東京都予選会"}]
[null,null,null,null,"複数枚のとき手入力可"]
[null,null,null,null,null,null,{"$f":"\"申込日　\"&TEXT(大会データ!$B$6,\"ggge年m月d日(aaa)\")","v":"申込日　平成29年10月17日(火)"}]
[]
[null,null,null,null,null,"学校名",{"$f":"学校データ!$C$1","v":"連体中学校"},null,null,null,null,null,null,"校長\n氏名",{"$f":"学校データ!$C$9","v":"中体 連"},null,null,null,null,"公印　　　"]
[null,null,null,null,null,"学　校\n所在地",{"$f":"\"〒 \"&TEXT(学校データ!$C$5,\"000-0000\")","v":"〒 123-4567"}]
[null,null,null,null,null,null,null,{"$f":"学校データ!$C$6","v":"東京都千代田区1-1-1"}]
[null,null,null,null,null,null,null,null,null,null,null,null,null,{"$f":"\"TEL    \"&学校データ!$C$7","v":"TEL    03-4567-8901"}]
[null,0,"---"]
[null,1,"GSL",null,null,"顧問\n氏名",{"$f":"学校データ!$C$11","v":"鋤井 小紋"},null,null,"印　　","監督\n氏名",{"$f":"学校データ!$C$15","v":"鋤井 小紋"},null,null,"印　　","引率者\n氏　名",{"$f":"学校データ!$C$19","v":"鋤井 小紋"},null,null,"印　　"]
[null,2,"SL",null,null,"自宅\nTEL",{"$f":"学校データ!$C$12","v":"03-9876-5432"},null,null,null,"監　　　　督\n所属学校名",{"$f":"学校データ!$C$16","v":"連体"},null,null,"中学校","校長・教員以外が引率者の\n場合、該当番号を記入⇒",null,{"$f":"IF(学校データ!$C$20>0,CHAR(CODE(\"①\")+学校データ!$C$20-1),\"\")","v":""},"　①学校職員\n　②外部指導者\n　③保護者"]
[null,3,"SL・GSL",null,null,"顧問\n携帯",{"$f":"学校データ!$C$13","v":"090-1234-5678"},null,null,null,"監督\n携帯",{"$f":"学校データ!$C$17","v":"090-1234-5678"},null,null,null,"引率者\n携　帯",{"$f":"学校データ!$C$21","v":"090-1234-5678"}]
[]
[null,null,null,6,null,null,3,null,null,null,null,6,5,10,11,12,null,13]
[]
[null,"SL","GSL",null,null,"No.","選　　手　　氏　　名",null,null,null,null,"性別","学年","申込種目\n（ＳＬ・ＧＳＬ）",null,"賠償責任保険"]
[{"$f":"15*(E2-1)","v":0},null,null,null,null,null,null,null,null,null,null,null,null,null,null,"会社名",null,"証券番号"]
[{"$f":"A19+1","v":1},{"$f":"1*(IF($D20>0,VLOOKUP($D20,選手リスト!$F$4:$R$103,N$16,FALSE),\"\")<>\"\")","v":1},{"$f":"1*(IF($D20>0,VLOOKUP($D20,選手リスト!$F$4:$R$103,O$16,FALSE),\"\")<>\"\")","v":1},{"$f":"VLOOKUP(A20,選手リスト!$A$4:$R$103,D$16,FALSE)","v":1},null,{"$f":"IF(ISERROR(D20),\"\",COUNTA(D$20:D20))","v":1},{"$f":"IF(ISERROR($D20),\"\",VLOOKUP($D20,選手リスト!$F$4:$R$103,G$16,FALSE))","v":"藍 上雄"},null,null,null,null,{"$f":"IF(ISERROR($D20),\"\",VLOOKUP($D20,選手リスト!$F$4:$R$103,L$16,FALSE))","v":1},{"$f":"IF(ISERROR($D20),\"\",VLOOKUP($D20,選手リスト!$F$4:$R$103,M$16,FALSE))","v":3},{"$f":"IF(ISERROR(D20),\"\",VLOOKUP(2*$B20+$C20,$B$11:$C$14,2,FALSE))","v":"SL・GSL"},null,{"$f":"IF(ISERROR($D20),\"\",VLOOKUP($D20,選手リスト!$F$4:$R$103,P$16,FALSE))","v":"ab損保"},null,{"$f":"IF(ISERROR($D20),\"\",VLOOKUP($D20,選手リスト!$F$4:$R$103,R$16,FALSE))","v":"A111111111"}]
[{"$f":"A20+1","v":2},{"$f":"1*(IF($D21>0,VLOOKUP($D21,選手リスト!$F$4:$R$103,N$16,FALSE),\"\")<>\"\")","v":1},{"$f":"1*(IF($D21>0,VLOOKUP($D21,選手リスト!$F$4:$R$103,O$16,FALSE),\"\")<>\"\")","v":0},{"$f":"VLOOKUP(A21,選手リスト!$A$4:$R$103,D$16,FALSE)","v":3},null,{"$f":"IF(ISERROR(D21),\"\",COUNTA(D$20:D21))","v":2},{"$f":"IF(ISERROR($D21),\"\",VLOOKUP($D21,選手リスト!$F$4:$R$103,G$16,FALSE))","v":"戸手 土太"},null,null,null,null,{"$f":"IF(ISERROR($D21),\"\",VLOOKUP($D21,選手リスト!$F$4:$R$103,L$16,FALSE))","v":1},{"$f":"IF(ISERROR($D21),\"\",VLOOKUP($D21,選手リスト!$F$4:$R$103,M$16,FALSE))","v":2},{"$f":"IF(ISERROR(D21),\"\",VLOOKUP(2*$B21+$C21,$B$11:$C$14,2,FALSE))","v":"SL"},null,{"$f":"IF(ISERROR($D21),\"\",VLOOKUP($D21,選手リスト!$F$4:$R$103,P$16,FALSE))","v":"水色ママ友海上"},null,{"$f":"IF(ISERROR($D21),\"\",VLOOKUP($D21,選手リスト!$F$4:$R$103,R$16,FALSE))","v":"C333333333"}]
[3,{"$f":"1*(IF($D22>0,VLOOKUP($D22,選手リスト!$F$4:$R$103,N$16,FALSE),\"\")<>\"\")","v":1},{"$f":"1*(IF($D22>0,VLOOKUP($D22,選手リスト!$F$4:$R$103,O$16,FALSE),\"\")<>\"\")","v":1},{"$f":"VLOOKUP(A22,選手リスト!$A$4:$R$103,D$16,FALSE)","v":8},null,{"$f":"IF(ISERROR(D22),\"\",COUNTA(D$20:D22))","v":3},{"$f":"IF(ISERROR($D22),\"\",VLOOKUP($D22,選手リスト!$F$4:$R$103,G$16,FALSE))","v":"呂連 瑠璃羅"},null,null,null,null,{"$f":"IF(ISERROR($D22),\"\",VLOOKUP($D22,選手リスト!$F$4:$R$103,L$16,FALSE))","v":1},{"$f":"IF(ISERROR($D22),\"\",VLOOKUP($D22,選手リスト!$F$4:$R$103,M$16,FALSE))","v":1},"SL・GSL",null,{"$f":"IF(ISERROR($D22),\"\",VLOOKUP($D22,選手リスト!$F$4:$R$103,P$16,FALSE))","v":"平成高田損保"},null,{"$f":"IF(ISERROR($D22),\"\",VLOOKUP($D22,選手リスト!$F$4:$R$103,R$16,FALSE))","v":"H888888888"}]
[4,{"$f":"1*(IF($D23>0,VLOOKUP($D23,選手リスト!$F$4:$R$103,N$16,FALSE),\"\")<>\"\")","v":1},{"$f":"1*(IF($D23>0,VLOOKUP($D23,選手リスト!$F$4:$R$103,O$16,FALSE),\"\")<>\"\")","v":1},{"$f":"VLOOKUP(A23,選手リスト!$A$4:$R$103,D$16,FALSE)","v":9},null,{"$f":"IF(ISERROR(D23),\"\",COUNTA(D$20:D23))","v":4},{"$f":"IF(ISERROR($D23),\"\",VLOOKUP($D23,選手リスト!$F$4:$R$103,G$16,FALSE))","v":"和井 上緒"},null,null,null,null,{"$f":"IF(ISERROR($D23),\"\",VLOOKUP($D23,選手リスト!$F$4:$R$103,L$16,FALSE))","v":1},{"$f":"IF(ISERROR($D23),\"\",VLOOKUP($D23,選手リスト!$F$4:$R$103,M$16,FALSE))","v":1},"SL・GSL",null,{"$f":"IF(ISERROR($D23),\"\",VLOOKUP($D23,選手リスト!$F$4:$R$103,P$16,FALSE))","v":"IROHA保険"},null,{"$f":"IF(ISERROR($D23),\"\",VLOOKUP($D23,選手リスト!$F$4:$R$103,R$16,FALSE))","v":"I999999999"}]
[5,{"$f":"1*(IF($D24>0,VLOOKUP($D24,選手リスト!$F$4:$R$103,N$16,FALSE),\"\")<>\"\")","v":1},{"$f":"1*(IF($D24>0,VLOOKUP($D24,選手リスト!$F$4:$R$103,O$16,FALSE),\"\")<>\"\")","v":1},{"$f":"VLOOKUP(A24,選手リスト!$A$4:$R$103,D$16,FALSE)","v":2},null,{"$f":"IF(ISERROR(D24),\"\",COUNTA(D$20:D24))","v":5},{"$f":"IF(ISERROR($D24),\"\",VLOOKUP($D24,選手リスト!$F$4:$R$103,G$16,FALSE))","v":"垣 九家子"},null,null,null,null,{"$f":"IF(ISERROR($D24),\"\",VLOOKUP($D24,選手リスト!$F$4:$R$103,L$16,FALSE))","v":2},{"$f":"IF(ISERROR($D24),\"\",VLOOKUP($D24,選手リスト!$F$4:$R$103,M$16,FALSE))","v":3},"SL・GSL",null,{"$f":"IF(ISERROR($D24),\"\",VLOOKUP($D24,選手リスト!$F$4:$R$103,P$16,FALSE))","v":"群馬長野海上"},null,{"$f":"IF(ISERROR($D24),\"\",VLOOKUP($D24,選手リスト!$F$4:$R$103,R$16,FALSE))","v":"B222222222"}]
[6,{"$f":"1*(IF($D25>0,VLOOKUP($D25,選手リスト!$F$4:$R$103,N$16,FALSE),\"\")<>\"\")","v":0},{"$f":"1*(IF($D25>0,VLOOKUP($D25,選手リスト!$F$4:$R$103,O$16,FALSE),\"\")<>\"\")","v":1},{"$f":"VLOOKUP(A25,選手リスト!$A$4:$R$103,D$16,FALSE)","v":4},null,{"$f":"IF(ISERROR(D25),\"\",COUNTA(D$20:D25))","v":6},{"$f":"IF(ISERROR($D25),\"\",VLOOKUP($D25,選手リスト!$F$4:$R$103,G$16,FALSE))","v":"菜煮怒 音乃"},null,null,null,null,{"$f":"IF(ISERROR($D25),\"\",VLOOKUP($D25,選手リスト!$F$4:$R$103,L$16,FALSE))","v":2},{"$f":"IF(ISERROR($D25),\"\",VLOOKUP($D25,選手リスト!$F$4:$R$103,M$16,FALSE))","v":2},"GSL",null,{"$f":"IF(ISERROR($D25),\"\",VLOOKUP($D25,選手リスト!$F$4:$R$103,P$16,FALSE))","v":"あえいおう損保"},null,{"$f":"IF(ISERROR($D25),\"\",VLOOKUP($D25,選手リスト!$F$4:$R$103,R$16,FALSE))","v":"D444444444"}]
[7,{"$f":"1*(IF($D26>0,VLOOKUP($D26,選手リスト!$F$4:$R$103,N$16,FALSE),\"\")<>\"\")","v":1},{"$f":"1*(IF($D26>0,VLOOKUP($D26,選手リスト!$F$4:$R$103,O$16,FALSE),\"\")<>\"\")","v":1},{"$f":"VLOOKUP(A26,選手リスト!$A$4:$R$103,D$16,FALSE)","v":6},null,{"$f":"IF(ISERROR(D26),\"\",COUNTA(D$20:D26))","v":7},{"$f":"IF(ISERROR($D26),\"\",VLOOKUP($D26,選手リスト!$F$4:$R$103,G$16,FALSE))","v":"茂芽武 美馬"},null,null,null,null,{"$f":"IF(ISERROR($D26),\"\",VLOOKUP($D26,選手リスト!$F$4:$R$103,L$16,FALSE))","v":2},{"$f":"IF(ISERROR($D26),\"\",VLOOKUP($D26,選手リスト!$F$4:$R$103,M$16,FALSE))","v":1},"SL・GSL",null,{"$f":"IF(ISERROR($D26),\"\",VLOOKUP($D26,選手リスト!$F$4:$R$103,P$16,FALSE))","v":"リニー損保"},null,{"$f":"IF(ISERROR($D26),\"\",VLOOKUP($D26,選手リスト!$F$4:$R$103,R$16,FALSE))","v":"F666666666"}]
[8,{"$f":"1*(IF($D27>0,VLOOKUP($D27,選手リスト!$F$4:$R$103,N$16,FALSE),\"\")<>\"\")","v":1},{"$f":"1*(IF($D27>0,VLOOKUP($D27,選手リスト!$F$4:$R$103,O$16,FALSE),\"\")<>\"\")","v":1},{"$f":"VLOOKUP(A27,選手リスト!$A$4:$R$103,D$16,FALSE)","v":7},null,{"$f":"IF(ISERROR(D27),\"\",COUNTA(D$20:D27))","v":8},{"$f":"IF(ISERROR($D27),\"\",VLOOKUP($D27,選手リスト!$F$4:$R$103,G$16,FALSE))","v":"矢井 由衣代"},null,null,null,null,{"$f":"IF(ISERROR($D27),\"\",VLOOKUP($D27,選手リスト!$F$4:$R$103,L$16,FALSE))","v":2},{"$f":"IF(ISERROR($D27),\"\",VLOOKUP($D27,選手リスト!$F$4:$R$103,M$16,FALSE))","v":1},"SL・GSL",null,{"$f":"IF(ISERROR($D27),\"\",VLOOKUP($D27,選手リスト!$F$4:$R$103,P$16,FALSE))","v":"小異火災海上"},null,{"$f":"IF(ISERROR($D27),\"\",VLOOKUP($D27,選手リスト!$F$4:$R$103,R$16,FALSE))","v":"G777777777"}]
[9,{"$f":"1*(IF($D28>0,VLOOKUP($D28,選手リスト!$F$4:$R$103,N$16,FALSE),\"\")<>\"\")","v":{"$error":"#N/A"}},{"$f":"1*(IF($D28>0,VLOOKUP($D28,選手リスト!$F$4:$R$103,O$16,FALSE),\"\")<>\"\")","v":{"$error":"#N/A"}},{"$f":"VLOOKUP(A28,選手リスト!$A$4:$R$103,D$16,FALSE)","v":{"$error":"#N/A"}},null,{"$f":"IF(ISERROR(D28),\"\",COUNTA(D$20:D28))","v":""},{"$f":"IF(ISERROR($D28),\"\",VLOOKUP($D28,選手リスト!$F$4:$R$103,G$16,FALSE))","v":""},null,null,null,null,{"$f":"IF(ISERROR($D28),\"\",VLOOKUP($D28,選手リスト!$F$4:$R$103,L$16,FALSE))","v":""},{"$f":"IF(ISERROR($D28),\"\",VLOOKUP($D28,選手リスト!$F$4:$R$103,M$16,FALSE))","v":""},"",null,{"$f":"IF(ISERROR($D28),\"\",VLOOKUP($D28,選手リスト!$F$4:$R$103,P$16,FALSE))","v":""},null,{"$f":"IF(ISERROR($D28),\"\",VLOOKUP($D28,選手リスト!$F$4:$R$103,R$16,FALSE))","v":""}]
[10,{"$f":"1*(IF($D29>0,VLOOKUP($D29,選手リスト!$F$4:$R$103,N$16,FALSE),\"\")<>\"\")","v":{"$error":"#N/A"}},{"$f":"1*(IF($D29>0,VLOOKUP($D29,選手リスト!$F$4:$R$103,O$16,FALSE),\"\")<>\"\")","v":{"$error":"#N/A"}},{"$f":"VLOOKUP(A29,選手リスト!$A$4:$R$103,D$16,FALSE)","v":{"$error":"#N/A"}},null,{"$f":"IF(ISERROR(D29),\"\",COUNTA(D$20:D29))","v":""},{"$f":"IF(ISERROR($D29),\"\",VLOOKUP($D29,選手リスト!$F$4:$R$103,G$16,FALSE))","v":""},null,null,null,null,{"$f":"IF(ISERROR($D29),\"\",VLOOKUP($D29,選手リスト!$F$4:$R$103,L$16,FALSE))","v":""},{"$f":"IF(ISERROR($D29),\"\",VLOOKUP($D29,選手リスト!$F$4:$R$103,M$16,FALSE))","v":""},"",null,{"$f":"IF(ISERROR($D29),\"\",VLOOKUP($D29,選手リスト!$F$4:$R$103,P$16,FALSE))","v":""},null,{"$f":"IF(ISERROR($D29),\"\",VLOOKUP($D29,選手リスト!$F$4:$R$103,R$16,FALSE))","v":""}]
[11,{"$f":"1*(IF($D30>0,VLOOKUP($D30,選手リスト!$F$4:$R$103,N$16,FALSE),\"\")<>\"\")","v":{"$error":"#N/A"}},{"$f":"1*(IF($D30>0,VLOOKUP($D30,選手リスト!$F$4:$R$103,O$16,FALSE),\"\")<>\"\")","v":{"$error":"#N/A"}},{"$f":"VLOOKUP(A30,選手リスト!$A$4:$R$103,D$16,FALSE)","v":{"$error":"#N/A"}},null,{"$f":"IF(ISERROR(D30),\"\",COUNTA(D$20:D30))","v":""},{"$f":"IF(ISERROR($D30),\"\",VLOOKUP($D30,選手リスト!$F$4:$R$103,G$16,FALSE))","v":""},null,null,null,null,{"$f":"IF(ISERROR($D30),\"\",VLOOKUP($D30,選手リスト!$F$4:$R$103,L$16,FALSE))","v":""},{"$f":"IF(ISERROR($D30),\"\",VLOOKUP($D30,選手リスト!$F$4:$R$103,M$16,FALSE))","v":""},"",null,{"$f":"IF(ISERROR($D30),\"\",VLOOKUP($D30,選手リスト!$F$4:$R$103,P$16,FALSE))","v":""},null,{"$f":"IF(ISERROR($D30),\"\",VLOOKUP($D30,選手リスト!$F$4:$R$103,R$16,FALSE))","v":""}]
[12,{"$f":"1*(IF($D31>0,VLOOKUP($D31,選手リスト!$F$4:$R$103,N$16,FALSE),\"\")<>\"\")","v":{"$error":"#N/A"}},{"$f":"1*(IF($D31>0,VLOOKUP($D31,選手リスト!$F$4:$R$103,O$16,FALSE),\"\")<>\"\")","v":{"$error":"#N/A"}},{"$f":"VLOOKUP(A31,選手リスト!$A$4:$R$103,D$16,FALSE)","v":{"$error":"#N/A"}},null,{"$f":"IF(ISERROR(D31),\"\",COUNTA(D$20:D31))","v":""},{"$f":"IF(ISERROR($D31),\"\",VLOOKUP($D31,選手リスト!$F$4:$R$103,G$16,FALSE))","v":""},null,null,null,null,{"$f":"IF(ISERROR($D31),\"\",VLOOKUP($D31,選手リスト!$F$4:$R$103,L$16,FALSE))","v":""},{"$f":"IF(ISERROR($D31),\"\",VLOOKUP($D31,選手リスト!$F$4:$R$103,M$16,FALSE))","v":""},"",null,{"$f":"IF(ISERROR($D31),\"\",VLOOKUP($D31,選手リスト!$F$4:$R$103,P$16,FALSE))","v":""},null,{"$f":"IF(ISERROR($D31),\"\",VLOOKUP($D31,選手リスト!$F$4:$R$103,R$16,FALSE))","v":""}]
[13,{"$f":"1*(IF($D32>0,VLOOKUP($D32,選手リスト!$F$4:$R$103,N$16,FALSE),\"\")<>\"\")","v":{"$error":"#N/A"}},{"$f":"1*(IF($D32>0,VLOOKUP($D32,選手リスト!$F$4:$R$103,O$16,FALSE),\"\")<>\"\")","v":{"$error":"#N/A"}},{"$f":"VLOOKUP(A32,選手リスト!$A$4:$R$103,D$16,FALSE)","v":{"$error":"#N/A"}},null,{"$f":"IF(ISERROR(D32),\"\",COUNTA(D$20:D32))","v":""},{"$f":"IF(ISERROR($D32),\"\",VLOOKUP($D32,選手リスト!$F$4:$R$103,G$16,FALSE))","v":""},null,null,null,null,{"$f":"IF(ISERROR($D32),\"\",VLOOKUP($D32,選手リスト!$F$4:$R$103,L$16,FALSE))","v":""},{"$f":"IF(ISERROR($D32),\"\",VLOOKUP($D32,選手リスト!$F$4:$R$103,M$16,FALSE))","v":""},"",null,{"$f":"IF(ISERROR($D32),\"\",VLOOKUP($D32,選手リスト!$F$4:$R$103,P$16,FALSE))","v":""},null,{"$f":"IF(ISERROR($D32),\"\",VLOOKUP($D32,選手リスト!$F$4:$R$103,R$16,FALSE))","v":""}]
[14,{"$f":"1*(IF($D33>0,VLOOKUP($D33,選手リスト!$F$4:$R$103,N$16,FALSE),\"\")<>\"\")","v":{"$error":"#N/A"}},{"$f":"1*(IF($D33>0,VLOOKUP($D33,選手リスト!$F$4:$R$103,O$16,FALSE),\"\")<>\"\")","v":{"$error":"#N/A"}},{"$f":"VLOOKUP(A33,選手リスト!$A$4:$R$103,D$16,FALSE)","v":{"$error":"#N/A"}},null,{"$f":"IF(ISERROR(D33),\"\",COUNTA(D$20:D33))","v":""},{"$f":"IF(ISERROR($D33),\"\",VLOOKUP($D33,選手リスト!$F$4:$R$103,G$16,FALSE))","v":""},null,null,null,null,{"$f":"IF(ISERROR($D33),\"\",VLOOKUP($D33,選手リスト!$F$4:$R$103,L$16,FALSE))","v":""},{"$f":"IF(ISERROR($D33),\"\",VLOOKUP($D33,選手リスト!$F$4:$R$103,M$16,FALSE))","v":""},"",null,{"$f":"IF(ISERROR($D33),\"\",VLOOKUP($D33,選手リスト!$F$4:$R$103,P$16,FALSE))","v":""},null,{"$f":"IF(ISERROR($D33),\"\",VLOOKUP($D33,選手リスト!$F$4:$R$103,R$16,FALSE))","v":""}]
[15,{"$f":"1*(IF($D34>0,VLOOKUP($D34,選手リスト!$F$4:$R$103,N$16,FALSE),\"\")<>\"\")","v":{"$error":"#N/A"}},{"$f":"1*(IF($D34>0,VLOOKUP($D34,選手リスト!$F$4:$R$103,O$16,FALSE),\"\")<>\"\")","v":{"$error":"#N/A"}},{"$f":"VLOOKUP(A34,選手リスト!$A$4:$R$103,D$16,FALSE)","v":{"$error":"#N/A"}},null,{"$f":"IF(ISERROR(D34),\"\",COUNTA(D$20:D34))","v":""},{"$f":"IF(ISERROR($D34),\"\",VLOOKUP($D34,選手リスト!$F$4:$R$103,G$16,FALSE))","v":""},null,null,null,null,{"$f":"IF(ISERROR($D34),\"\",VLOOKUP($D34,選手リスト!$F$4:$R$103,L$16,FALSE))","v":""},{"$f":"IF(ISERROR($D34),\"\",VLOOKUP($D34,選手リスト!$F$4:$R$103,M$16,FALSE))","v":""},"",null,{"$f":"IF(ISERROR($D34),\"\",VLOOKUP($D34,選手リスト!$F$4:$R$103,P$16,FALSE))","v":""},null,{"$f":"IF(ISERROR($D34),\"\",VLOOKUP($D34,選手リスト!$F$4:$R$103,R$16,FALSE))","v":""}]
[]
[null,"性別","性別",null,null,"個人票","SL",null,"GSL",null,null,null,null,null,null,"東京都中学校体育大会監督依頼報告書",null,null,"○","○"]
[null,1,2,null,null,"男",{"$f":"DSUM($B$18:$T$34,G$36,$B$36:$B$37)","v":4},null,{"$f":"DSUM($B$18:$T$34,I$36,$B$36:$B$37)","v":3}]
[null,{"$f":"学校データ!$C$23","v":0},{"$f":"学校データ!$C$24","v":0},null,null,"女",{"$f":"DSUM($B$18:$T$34,G$36,$C$36:$C$37)","v":3},null,{"$f":"DSUM($B$18:$T$34,I$36,$C$36:$C$37)","v":4},null,null,null,null,null,null,"外部指導者承認書",null,null,"○","○"]
[null,null,null,null,null,"合計人数",{"$f":"SUM(G37:H38)","v":7},null,{"$f":"SUM(I37:J38)","v":7}]
[null,null,null,3500,null,"合計金額",{"$f":"$D40*G39","v":24500},null,{"$f":"$D40*I39","v":24500}]
[]
[null,null,null,null,null,"総合計金額",null,{"$f":"SUM(G40:J40)","v":49000},null,null,null,null,null,null,"本申込書に関する個人情報は、本連盟の行事以外には使用いたしません。"]

{"sheet":"申込個人票","index":1,"n_rows":37,"n_cols":17,"rows_kept":37,"cut":false,"hidden":false,"merged":[[33,15,33,16],[34,4,34,6],[34,10,34,13],[15,4,15,6],[15,10,15,13],[16,10,16,13],[17,10,17,13],[15,14,16,16],[22,2,22,9],[22,11,22,16],[23,2,23,9],[23,11,23,16],[30,12,30,16],[14,15,14,16],[36,10,36,13],[28,12,28,13],[28,14,28,15],[31,3,32,3],[24,2,24,9],[24,11,24,16],[25,11,25,16],[27,12,27,13],[27,14,27,15],[30,4,30,8],[31,4,32,8],[34,14,35,16],[26,4,26,7],[27,4,28,7],[35,10,35,13],[12,3,13,3],[5,2,5,9],[5,11,5,16],[6,11,6,16],[8,12,8,13],[8,14,8,15],[11,12,11,16],[12,4,13,8],[11,4,11,8],[3,2,3,9],[3,11,3,16],[4,2,4,9],[4,11,4,16],[9,12,9,13],[9,14,9,15],[8,4,9,7],[7,4,7,7]]}
[null,null,null,null,null,null,null,null,null,null,null,null,10000,1000,100,10,1]
[null,"↓選手番号（手入力も可）"]
[7,9]
[{"$f":"VLOOKUP($B$3,選手リスト!$F$4:$R$103,A3,FALSE)","v":10404},null,"ＳＬSLSLSLSLSLSLSLSLSLSLSLSLSLSLSLSLSLSLSLSLSLSLSLSLSLSLSLSLSL",null,null,null,null,null,null,null,null,"大　　　会　　　名"]
[null,null,"　回　転　（　Ｓ　Ｌ　）　個　人　票　",null,null,null,null,null,null,null,null,{"$f":"\"第\"&大会データ!$B$3&\"回東京都中学校スキー大会\"","v":"第30回東京都中学校スキー大会"}]
[null,null,"SLSLSLSLSLSLSLSLSLSLSLSLSLSLSLSLSLSLSLSLSLSLSLSLSLSLSLSLSLSLSLSLSL",null,null,null,null,null,null,null,null,{"$f":"\"第\"&大会データ!$B$4&\"回全国中学校スキー大会\"","v":"第55回全国中学校スキー大会"}]
[null,null,null,null,null,null,null,null,null,null,null,"東京都予選会　Ｓ　Ｌ"]
[null,null,null,"フリガナ",{"$f":"学校データ!$C$3","v":"レンタイ"}]
[null,null,null,"学校名",{"$f":"学校データ!$C$2","v":"連体"},null,null,null,null,null,null,null,"種　目",null,"Ｓ　Ｌ"]
[6,null,null,"略　称",null,null,null,null,null,null,null,null,"組　別",null,{"$f":"VLOOKUP($B$3,選手リスト!$F$4:$R$103,申込個人票!$A10,FALSE)","v":1}]
[]
[4,null,null,"フリガナ",{"$f":"VLOOKUP($B$3,選手リスト!$F$4:$R$103,申込個人票!$A12,FALSE)","v":"ワヰ ウヱヲ"},null,null,null,null,"学年",null,null,"ＳＡＴ競技者登録番号"]
[3,null,null,"氏　名",{"$f":"VLOOKUP($B$3,選手リスト!$F$4:$R$103,申込個人票!$A13,FALSE)","v":"和井 上緒"},null,null,null,null,{"$f":"VLOOKUP($B$3,選手リスト!$F$4:$R$103,申込個人票!$A14,FALSE)","v":1},null,null,{"$f":"MOD(INT($A$4/M1),10)","v":1},{"$f":"MOD(INT($A$4/N1),10)","v":0},4,0,4]
[5,null,null,null,null,null,null,null,null,"年"]
[null,null,null,null,null,null,null,null,null,null,null,null,null,null,null,"〈右寄せ〉"]
[8,null,null,null,"東京都中体連使用欄",null,null,null,null,null,"（＊）前年度　Ｓ　Ｌ",null,null,null,{"$f":"IF(A17,\"---\",VLOOKUP($B$3,選手リスト!$F$4:$R$103,申込個人票!$A16,FALSE))","v":"---"}]
[{"$f":"(VLOOKUP($B$3,選手リスト!$F$4:$R$103,申込個人票!$A16,FALSE)=\"\")","v":true},null,null,null,null,null,null,null,null,null,"　　　ＳＡＴポイント"]
[10,null,null,null,null,null,null,null,null,null,"（＊＊）校内ランキング",null,null,null,{"$f":"IF($A17,VLOOKUP($B$3,選手リスト!$F$4:$R$103,申込個人票!$A10,FALSE),\"\")","v":1},{"$f":"IF($A17,VLOOKUP($B$3,選手リスト!$F$4:$R$103,申込個人票!$A18,FALSE),\"\")","v":1},"位"]
[]
[null,null,null,null,null,null,null,null,null,null,null,null,null,null,null,null,"キリトリ"]
[null,null,"キリトリ"]
[]
[null,null,"ＧＳＬGSLGSLGSLGSLGSLGSLGSLGSLGSLGSLGSLGSLGSLGSLGSLGSLGSL",null,null,null,null,null,null,null,null,"大　　　会　　　名"]
[null,null,"　大回転　（　ＧＳＬ　）　個　人　票　",null,null,null,null,null,null,null,null,{"$f":"\"第\"&大会データ!$B$3&\"回東京都中学校スキー大会\"","v":"第30回東京都中学校スキー大会"}]
[null,null,"GSLGSLGSLGSLGSLGSLGSLGSLGSLGSLGSLGSLGSLGSLGSLGSLGSLGSLGSLGSLGSLGSL",null,null,null,null,null,null,null,null,{"$f":"\"第\"&大会データ!$B$4&\"回全国中学校スキー大会\"","v":"第55回全国中学校スキー大会"}]
[null,null,null,null,null,null,null,null,null,null,null,"東京都予選会　ＧＳＬ"]
[null,null,null,"フリガナ",{"$f":"学校データ!$C$3","v":"レンタイ"}]
[null,null,null,"学校名",{"$f":"学校データ!$C$2","v":"連体"},null,null,null,null,null,null,null,"種　目",null,"ＧＳＬ"]
[null,null,null,"略　称",null,null,null,null,null,null,null,null,"組　別",null,{"$f":"O10","v":1}]
[]
[null,null,null,"フリガナ",{"$f":"E12","v":"ワヰ ウヱヲ"},null,null,null,null,"学年",null,null,"ＳＡＴ競技者登録番号"]
[null,null,null,"氏　名",{"$f":"E13","v":"和井 上緒"},null,null,null,null,{"$f":"J13","v":1},null,null,{"$f":"M13","v":1},{"$f":"N13","v":0},4,0,4]
[null,null,null,null,null,null,null,null,null,"年"]
[null,null,null,null,null,null,null,null,null,null,null,null,null,null,null,"〈右寄せ〉"]
[9,null,null,null,"東京都中体連使用欄",null,null,null,null,null,"（＊）前年度　ＧＳＬ",null,null,null,{"$f":"IF(A36,\"---\",VLOOKUP($B$3,選手リスト!$F$4:$R$103,申込個人票!$A35,FALSE))","v":"---"}]
[{"$f":"(VLOOKUP($B$3,選手リスト!$F$4:$R$103,申込個人票!$A35,FALSE)=\"\")","v":true},null,null,null,null,null,null,null,null,null,"　　　ＳＡＴポイント"]
[11,null,null,null,null,null,null,null,null,null,"（＊＊）校内ランキング",null,null,null,{"$f":"IF($A36,O18,\"\")","v":1},{"$f":"IF($A36,VLOOKUP($B$3,選手リスト!$F$4:$R$103,申込個人票!$A37,FALSE),\"\")","v":1},"位"]

{"sheet":"選手リスト","index":2,"n_rows":103,"n_cols":24,"rows_kept":103,"cut":false,"hidden":false,"merged":[[1,20,1,21],[1,22,1,23],[1,6,2,6],[1,11,2,11],[1,7,2,7],[1,8,2,8],[1,9,2,9],[1,10,2,10],[1,5,2,5],[1,16,2,16],[1,17,2,17],[0,14,0,15],[1,3,1,4],[1,12,1,13],[1,14,1,15]]}
[null,null,{"$f":"INT((C2-1)/15)+1","v":1},null,null,null,"する=1\n↓",null,null,null,"男=1\n女=2\n↓",null,null,null,"する=0 or 校内順位\n↓　　",null,null,null,null,"順位確認表"]
[{"$f":"COUNTIF($B$4:$B$103,0)","v":92},null,{"$f":"COUNTIF(C4:C103,\">0\")","v":8},"校内順位",null,"No.","個人票\n印刷","氏名","フリガナ","学年","性別","SAT\n競技者\n番号","SATポイント",null,"大会申込",null,"保険会社","保険証券番号",null,null,1,null,2]
[null,null,null,"SL","GS",null,null,null,null,null,null,null,"SL","GS","SL","GS",null,null,null,null,"SL","GS","SL","GS"]
[{"$f":"RANK(B4,$B$4:$B$103,1)-A$2","v":1},{"$f":"(C4>0)*(COUNTIF(C$4:C4,\">0\")+100*(C4=2))","v":1},{"$f":"IF(O4&P4=\"\",0,K4)","v":1},{"$f":"IF(O4>0,$K4&O4,\"\")","v":""},{"$f":"IF(P4>0,$K4&P4,\"\")","v":""},1,1,"藍 上雄","アイ ウエオ",3,1,6666,111.11,101.01,0,0,"ab損保","A111111111",null,1,{"$f":"VLOOKUP(U$2&$T4,$D$4:$R$103,5,FALSE)","v":"和井 上緒"},{"$f":"VLOOKUP(U$2&$T4,$E$4:$R$103,4,FALSE)","v":"和井 上緒"},{"$f":"VLOOKUP(W$2&$T4,$D$4:$R$103,5,FALSE)","v":"茂芽武 美馬"},{"$f":"VLOOKUP(W$2&$T4,$E$4:$R$103,4,FALSE)","v":"矢井 由衣代"}]
[{"$f":"RANK(B5,$B$4:$B$103,1)-A$2","v":5},{"$f":"(C5>0)*(COUNTIF(C$4:C5,\">0\")+100*(C5=2))","v":102},{"$f":"IF(O5&P5=\"\",0,K5)","v":2},{"$f":"IF(O5>0,$K5&O5,\"\")","v":""},{"$f":"IF(P5>0,$K5&P5,\"\")","v":""},2,1,"垣 九家子","カキ クケコ",3,2,7777,222.22,202.02,0,0,"群馬長野海上","B222222222",null,2,"呂連 瑠璃羅","呂連 瑠璃羅","矢井 由衣代","茂芽武 美馬"]
[2,{"$f":"(C6>0)*(COUNTIF(C$4:C6,\">0\")+100*(C6=2))","v":3},1,"","",3,1,"戸手 土太","トテ ツチタ",2,1,8888,333.33,303.02999999999997,0,null,"水色ママ友海上","C333333333",null,3,{"$error":"#N/A"},{"$error":"#N/A"},{"$error":"#N/A"},{"$error":"#N/A"}]
[6,{"$f":"(C7>0)*(COUNTIF(C$4:C7,\">0\")+100*(C7=2))","v":104},2,"","",4,1,"菜煮怒 音乃","ナニヌ ネノ",2,2,9999,444.44,404.04,null,0,"あえいおう損保","D444444444",null,4,{"$error":"#N/A"},{"$error":"#N/A"},{"$error":"#N/A"},{"$error":"#N/A"}]
[-91,{"$f":"(C8>0)*(COUNTIF(C$4:C8,\">0\")+100*(C8=2))","v":0},0,"","",5,null,"保戸 不比葉","ホヘ フヒハ",2,1,10000,555.54999999999995,505.05,null,null,"損保パジャマ","E555555555",null,5,{"$error":"#N/A"},{"$error":"#N/A"},{"$error":"#N/A"},{"$error":"#N/A"}]
[7,{"$f":"(C9>0)*(COUNTIF(C$4:C9,\">0\")+100*(C9=2))","v":105},2,"21","22",6,1,"茂芽武 美馬","モメム ミマ",1,2,10101,null,null,1,2,"リニー損保","F666666666",null,6,{"$error":"#N/A"},{"$error":"#N/A"},{"$error":"#N/A"},{"$error":"#N/A"}]
[8,{"$f":"(C10>0)*(COUNTIF(C$4:C10,\">0\")+100*(C10=2))","v":106},2,"22","21",7,1,"矢井 由衣代","ヤイ ユエヨ",1,2,10202,null,null,2,1,"小異火災海上","G777777777",null,7,{"$error":"#N/A"},{"$error":"#N/A"},{"$error":"#N/A"},{"$error":"#N/A"}]
[3,{"$f":"(C11>0)*(COUNTIF(C$4:C11,\">0\")+100*(C11=2))","v":7},1,"12","12",8,1,"呂連 瑠璃羅","ロレ ルリラ",1,1,10303,null,null,2,2,"平成高田損保","H888888888",null,8,{"$error":"#N/A"},{"$error":"#N/A"},{"$error":"#N/A"},{"$error":"#N/A"}]
[4,{"$f":"(C12>0)*(COUNTIF(C$4:C12,\">0\")+100*(C12=2))","v":8},1,"11","11",9,1,"和井 上緒","ワヰ ウヱヲ",1,1,10404,null,null,1,1,"IROHA保険","I999999999",null,9,{"$error":"#N/A"},{"$error":"#N/A"},{"$error":"#N/A"},{"$error":"#N/A"}]
[-91,{"$f":"(C13>0)*(COUNTIF(C$4:C13,\">0\")+100*(C13=2))","v":0},0,null,null,10,null,null,null,null,null,null,null,null,null,null,null,null,null,10,{"$error":"#N/A"},{"$error":"#N/A"},{"$error":"#N/A"},{"$error":"#N/A"}]
[-91,{"$f":"(C14>0)*(COUNTIF(C$4:C14,\">0\")+100*(C14=2))","v":0},0,null,null,11,null,null,null,null,null,null,null,null,null,null,null,null,null,11,{"$error":"#N/A"},{"$error":"#N/A"},{"$error":"#N/A"},{"$error":"#N/A"}]
[-91,{"$f":"(C15>0)*(COUNTIF(C$4:C15,\">0\")+100*(C15=2))","v":0},0,null,null,12,null,null,null,null,null,null,null,null,null,null,null,null,null,12,{"$error":"#N/A"},{"$error":"#N/A"},{"$error":"#N/A"},{"$error":"#N/A"}]
[-91,{"$f":"(C16>0)*(COUNTIF(C$4:C16,\">0\")+100*(C16=2))","v":0},0,null,null,13,null,null,null,null,null,null,null,null,null,null,null,null,null,13,{"$error":"#N/A"},{"$error":"#N/A"},{"$error":"#N/A"},{"$error":"#N/A"}]
[-91,{"$f":"(C17>0)*(COUNTIF(C$4:C17,\">0\")+100*(C17=2))","v":0},0,null,null,14,null,null,null,null,null,null,null,null,null,null,null,null,null,14,{"$error":"#N/A"},{"$error":"#N/A"},{"$error":"#N/A"},{"$error":"#N/A"}]
[-91,{"$f":"(C18>0)*(COUNTIF(C$4:C18,\">0\")+100*(C18=2))","v":0},0,null,null,15,null,null,null,null,null,null,null,null,null,null,null,null,null,15,{"$error":"#N/A"},{"$error":"#N/A"},{"$error":"#N/A"},{"$error":"#N/A"}]
[-91,{"$f":"(C19>0)*(COUNTIF(C$4:C19,\">0\")+100*(C19=2))","v":0},0,null,null,16,null,null,null,null,null,null,null,null,null,null,null,null,null,16,{"$error":"#N/A"},{"$error":"#N/A"},{"$error":"#N/A"},{"$error":"#N/A"}]
[-91,{"$f":"(C20>0)*(COUNTIF(C$4:C20,\">0\")+100*(C20=2))","v":0},0,null,null,17,null,null,null,null,null,null,null,null,null,null,null,null,null,17,{"$error":"#N/A"},{"$error":"#N/A"},{"$error":"#N/A"},{"$error":"#N/A"}]
[-91,{"$f":"(C21>0)*(COUNTIF(C$4:C21,\">0\")+100*(C21=2))","v":0},0,null,null,18,null,null,null,null,null,null,null,null,null,null,null,null,null,18,{"$error":"#N/A"},{"$error":"#N/A"},{"$error":"#N/A"},{"$error":"#N/A"}]
[-91,{"$f":"(C22>0)*(COUNTIF(C$4:C22,\">0\")+100*(C22=2))","v":0},0,null,null,19,null,null,null,null,null,null,null,null,null,null,null,null,null,19,{"$error":"#N/A"},{"$error":"#N/A"},{"$error":"#N/A"},{"$error":"#N/A"}]
[-91,{"$f":"(C23>0)*(COUNTIF(C$4:C23,\">0\")+100*(C23=2))","v":0},0,null,null,20,null,null,null,null,null,null,null,null,null,null,null,null,null,20,{"$error":"#N/A"},{"$error":"#N/A"},{"$error":"#N/A"},{"$error":"#N/A"}]
[-91,{"$f":"(C24>0)*(COUNTIF(C$4:C24,\">0\")+100*(C24=2))","v":0},0,null,null,21,null,null,null,null,null,null,null,null,null,null,null,null,null,21,{"$error":"#N/A"},{"$error":"#N/A"},{"$error":"#N/A"},{"$error":"#N/A"}]
[-91,{"$f":"(C25>0)*(COUNTIF(C$4:C25,\">0\")+100*(C25=2))","v":0},0,null,null,22,null,null,null,null,null,null,null,null,null,null,null,null,null,22,{"$error":"#N/A"},{"$error":"#N/A"},{"$error":"#N/A"},{"$error":"#N/A"}]
[-91,{"$f":"(C26>0)*(COUNTIF(C$4:C26,\">0\")+100*(C26=2))","v":0},0,null,null,23,null,null,null,null,null,null,null,null,null,null,null,null,null,23,{"$error":"#N/A"},{"$error":"#N/A"},{"$error":"#N/A"},{"$error":"#N/A"}]
[-91,{"$f":"(C27>0)*(COUNTIF(C$4:C27,\">0\")+100*(C27=2))","v":0},0,null,null,24,null,null,null,null,null,null,null,null,null,null,null,null,null,24,{"$error":"#N/A"},{"$error":"#N/A"},{"$error":"#N/A"},{"$error":"#N/A"}]
[-91,{"$f":"(C28>0)*(COUNTIF(C$4:C28,\">0\")+100*(C28=2))","v":0},0,null,null,25,null,null,null,null,null,null,null,null,null,null,null,null,null,25,{"$error":"#N/A"},{"$error":"#N/A"},{"$error":"#N/A"},{"$error":"#N/A"}]
[-91,{"$f":"(C29>0)*(COUNTIF(C$4:C29,\">0\")+100*(C29=2))","v":0},0,null,null,26,null,null,null,null,null,null,null,null,null,null,null,null,null,26,{"$error":"#N/A"},{"$error":"#N/A"},{"$error":"#N/A"},{"$error":"#N/A"}]
[-91,{"$f":"(C30>0)*(COUNTIF(C$4:C30,\">0\")+100*(C30=2))","v":0},0,null,null,27,null,null,null,null,null,null,null,null,null,null,null,null,null,27,{"$error":"#N/A"},{"$error":"#N/A"},{"$error":"#N/A"},{"$error":"#N/A"}]
[-91,{"$f":"(C31>0)*(COUNTIF(C$4:C31,\">0\")+100*(C31=2))","v":0},0,null,null,28,null,null,null,null,null,null,null,null,null,null,null,null,null,28,{"$error":"#N/A"},{"$error":"#N/A"},{"$error":"#N/A"},{"$error":"#N/A"}]
[-91,{"$f":"(C32>0)*(COUNTIF(C$4:C32,\">0\")+100*(C32=2))","v":0},0,null,null,29,null,null,null,null,null,null,null,null,null,null,null,null,null,29,{"$error":"#N/A"},{"$error":"#N/A"},{"$error":"#N/A"},{"$error":"#N/A"}]
[-91,{"$f":"(C33>0)*(COUNTIF(C$4:C33,\">0\")+100*(C33=2))","v":0},0,null,null,30,null,null,null,null,null,null,null,null,null,null,null,null,null,30,{"$error":"#N/A"},{"$error":"#N/A"},{"$error":"#N/A"},{"$error":"#N/A"}]
[-91,{"$f":"(C34>0)*(COUNTIF(C$4:C34,\">0\")+100*(C34=2))","v":0},0,null,null,31,null,null,null,null,null,null,null,null,null,null,null,null,null,31,{"$error":"#N/A"},{"$error":"#N/A"},{"$error":"#N/A"},{"$error":"#N/A"}]
[-91,{"$f":"(C35>0)*(COUNTIF(C$4:C35,\">0\")+100*(C35=2))","v":0},0,null,null,32,null,null,null,null,null,null,null,null,null,null,null,null,null,32,{"$error":"#N/A"},{"$error":"#N/A"},{"$error":"#N/A"},{"$error":"#N/A"}]
[-91,{"$f":"(C36>0)*(COUNTIF(C$4:C36,\">0\")+100*(C36=2))","v":0},0,null,null,33,null,null,null,null,null,null,null,null,null,null,null,null,null,33,{"$f":"VLOOKUP(U$2&$T36,$D$4:$R$103,5,FALSE)","v":{"$error":"#N/A"}},{"$f":"VLOOKUP(U$2&$T36,$E$4:$R$103,4,FALSE)","v":{"$error":"#N/A"}},{"$f":"VLOOKUP(W$2&$T36,$D$4:$R$103,5,FALSE)","v":{"$error":"#N/A"}},{"$f":"VLOOKUP(W$2&$T36,$E$4:$R$103,4,FALSE)","v":{"$error":"#N/A"}}]
[-91,{"$f":"(C37>0)*(COUNTIF(C$4:C37,\">0\")+100*(C37=2))","v":0},0,null,null,34,null,null,null,null,null,null,null,null,null,null,null,null,null,34,{"$error":"#N/A"},{"$error":"#N/A"},{"$error":"#N/A"},{"$error":"#N/A"}]
[-91,{"$f":"(C38>0)*(COUNTIF(C$4:C38,\">0\")+100*(C38=2))","v":0},0,null,null,35,null,null,null,null,null,null,null,null,null,null,null,null,null,35,{"$error":"#N/A"},{"$error":"#N/A"},{"$error":"#N/A"},{"$error":"#N/A"}]
[-91,{"$f":"(C39>0)*(COUNTIF(C$4:C39,\">0\")+100*(C39=2))","v":0},0,null,null,36,null,null,null,null,null,null,null,null,null,null,null,null,null,36,{"$error":"#N/A"},{"$error":"#N/A"},{"$error":"#N/A"},{"$error":"#N/A"}]
[-91,{"$f":"(C40>0)*(COUNTIF(C$4:C40,\">0\")+100*(C40=2))","v":0},0,null,null,37,null,null,null,null,null,null,null,null,null,null,null,null,null,37,{"$error":"#N/A"},{"$error":"#N/A"},{"$error":"#N/A"},{"$error":"#N/A"}]
[-91,{"$f":"(C41>0)*(COUNTIF(C$4:C41,\">0\")+100*(C41=2))","v":0},0,null,null,38,null,null,null,null,null,null,null,null,null,null,null,null,null,38,{"$error":"#N/A"},{"$error":"#N/A"},{"$error":"#N/A"},{"$error":"#N/A"}]
[-91,{"$f":"(C42>0)*(COUNTIF(C$4:C42,\">0\")+100*(C42=2))","v":0},0,null,null,39,null,null,null,null,null,null,null,null,null,null,null,null,null,39,{"$error":"#N/A"},{"$error":"#N/A"},{"$error":"#N/A"},{"$error":"#N/A"}]
[-91,{"$f":"(C43>0)*(COUNTIF(C$4:C43,\">0\")+100*(C43=2))","v":0},0,null,null,40,null,null,null,null,null,null,null,null,null,null,null,null,null,40,{"$error":"#N/A"},{"$error":"#N/A"},{"$error":"#N/A"},{"$error":"#N/A"}]
[-91,{"$f":"(C44>0)*(COUNTIF(C$4:C44,\">0\")+100*(C44=2))","v":0},0,null,null,41,null,null,null,null,null,null,null,null,null,null,null,null,null,41,{"$error":"#N/A"},{"$error":"#N/A"},{"$error":"#N/A"},{"$error":"#N/A"}]
[-91,{"$f":"(C45>0)*(COUNTIF(C$4:C45,\">0\")+100*(C45=2))","v":0},0,null,null,42,null,null,null,null,null,null,null,null,null,null,null,null,null,42,{"$error":"#N/A"},{"$error":"#N/A"},{"$error":"#N/A"},{"$error":"#N/A"}]
[-91,{"$f":"(C46>0)*(COUNTIF(C$4:C46,\">0\")+100*(C46=2))","v":0},0,null,null,43,null,null,null,null,null,null,null,null,null,null,null,null,null,43,{"$error":"#N/A"},{"$error":"#N/A"},{"$error":"#N/A"},{"$error":"#N/A"}]
[-91,{"$f":"(C47>0)*(COUNTIF(C$4:C47,\">0\")+100*(C47=2))","v":0},0,null,null,44,null,null,null,null,null,null,null,null,null,null,null,null,null,44,{"$error":"#N/A"},{"$error":"#N/A"},{"$error":"#N/A"},{"$error":"#N/A"}]
[-91,{"$f":"(C48>0)*(COUNTIF(C$4:C48,\">0\")+100*(C48=2))","v":0},0,null,null,45,null,null,null,null,null,null,null,null,null,null,null,null,null,45,{"$error":"#N/A"},{"$error":"#N/A"},{"$error":"#N/A"},{"$error":"#N/A"}]
[-91,{"$f":"(C49>0)*(COUNTIF(C$4:C49,\">0\")+100*(C49=2))","v":0},0,null,null,46,null,null,null,null,null,null,null,null,null,null,null,null,null,46,{"$error":"#N/A"},{"$error":"#N/A"},{"$error":"#N/A"},{"$error":"#N/A"}]
[-91,{"$f":"(C50>0)*(COUNTIF(C$4:C50,\">0\")+100*(C50=2))","v":0},0,null,null,47,null,null,null,null,null,null,null,null,null,null,null,null,null,47,{"$error":"#N/A"},{"$error":"#N/A"},{"$error":"#N/A"},{"$error":"#N/A"}]
[-91,{"$f":"(C51>0)*(COUNTIF(C$4:C51,\">0\")+100*(C51=2))","v":0},0,null,null,48,null,null,null,null,null,null,null,null,null,null,null,null,null,48,{"$error":"#N/A"},{"$error":"#N/A"},{"$error":"#N/A"},{"$error":"#N/A"}]
[-91,{"$f":"(C52>0)*(COUNTIF(C$4:C52,\">0\")+100*(C52=2))","v":0},0,null,null,49,null,null,null,null,null,null,null,null,null,null,null,null,null,49,{"$error":"#N/A"},{"$error":"#N/A"},{"$error":"#N/A"},{"$error":"#N/A"}]
[-91,{"$f":"(C53>0)*(COUNTIF(C$4:C53,\">0\")+100*(C53=2))","v":0},0,null,null,50,null,null,null,null,null,null,null,null,null,null,null,null,null,50,{"$error":"#N/A"},{"$error":"#N/A"},{"$error":"#N/A"},{"$error":"#N/A"}]
[-91,{"$f":"(C54>0)*(COUNTIF(C$4:C54,\">0\")+100*(C54=2))","v":0},0,null,null,51,null,null,null,null,null,null,null,null,null,null,null,null,null,51,{"$error":"#N/A"},{"$error":"#N/A"},{"$error":"#N/A"},{"$error":"#N/A"}]
[-91,{"$f":"(C55>0)*(COUNTIF(C$4:C55,\">0\")+100*(C55=2))","v":0},0,null,null,52,null,null,null,null,null,null,null,null,null,null,null,null,null,52,{"$error":"#N/A"},{"$error":"#N/A"},{"$error":"#N/A"},{"$error":"#N/A"}]
[-91,{"$f":"(C56>0)*(COUNTIF(C$4:C56,\">0\")+100*(C56=2))","v":0},0,null,null,53,null,null,null,null,null,null,null,null,null,null,null,null,null,53,{"$error":"#N/A"},{"$error":"#N/A"},{"$error":"#N/A"},{"$error":"#N/A"}]
[-91,{"$f":"(C57>0)*(COUNTIF(C$4:C57,\">0\")+100*(C57=2))","v":0},0,null,null,54,null,null,null,null,null,null,null,null,null,null,null,null,null,54,{"$error":"#N/A"},{"$error":"#N/A"},{"$error":"#N/A"},{"$error":"#N/A"}]
[-91,{"$f":"(C58>0)*(COUNTIF(C$4:C58,\">0\")+100*(C58=2))","v":0},0,null,null,55,null,null,null,null,null,null,null,null,null,null,null,null,null,55,{"$error":"#N/A"},{"$error":"#N/A"},{"$error":"#N/A"},{"$error":"#N/A"}]
[-91,{"$f":"(C59>0)*(COUNTIF(C$4:C59,\">0\")+100*(C59=2))","v":0},0,null,null,56,null,null,null,null,null,null,null,null,null,null,null,null,null,56,{"$error":"#N/A"},{"$error":"#N/A"},{"$error":"#N/A"},{"$error":"#N/A"}]
[-91,{"$f":"(C60>0)*(COUNTIF(C$4:C60,\">0\")+100*(C60=2))","v":0},0,null,null,57,null,null,null,null,null,null,null,null,null,null,null,null,null,57,{"$error":"#N/A"},{"$error":"#N/A"},{"$error":"#N/A"},{"$error":"#N/A"}]
[-91,{"$f":"(C61>0)*(COUNTIF(C$4:C61,\">0\")+100*(C61=2))","v":0},0,null,null,58,null,null,null,null,null,null,null,null,null,null,null,null,null,58,{"$error":"#N/A"},{"$error":"#N/A"},{"$error":"#N/A"},{"$error":"#N/A"}]
[-91,{"$f":"(C62>0)*(COUNTIF(C$4:C62,\">0\")+100*(C62=2))","v":0},0,null,null,59,null,null,null,null,null,null,null,null,null,null,null,null,null,59,{"$error":"#N/A"},{"$error":"#N/A"},{"$error":"#N/A"},{"$error":"#N/A"}]
[-91,{"$f":"(C63>0)*(COUNTIF(C$4:C63,\">0\")+100*(C63=2))","v":0},0,null,null,60,null,null,null,null,null,null,null,null,null,null,null,null,null,60,{"$error":"#N/A"},{"$error":"#N/A"},{"$error":"#N/A"},{"$error":"#N/A"}]
[-91,{"$f":"(C64>0)*(COUNTIF(C$4:C64,\">0\")+100*(C64=2))","v":0},0,null,null,61,null,null,null,null,null,null,null,null,null,null,null,null,null,61,{"$error":"#N/A"},{"$error":"#N/A"},{"$error":"#N/A"},{"$error":"#N/A"}]
[-91,{"$f":"(C65>0)*(COUNTIF(C$4:C65,\">0\")+100*(C65=2))","v":0},0,null,null,62,null,null,null,null,null,null,null,null,null,null,null,null,null,62,{"$error":"#N/A"},{"$error":"#N/A"},{"$error":"#N/A"},{"$error":"#N/A"}]
[-91,{"$f":"(C66>0)*(COUNTIF(C$4:C66,\">0\")+100*(C66=2))","v":0},0,null,null,63,null,null,null,null,null,null,null,null,null,null,null,null,null,63,{"$error":"#N/A"},{"$error":"#N/A"},{"$error":"#N/A"},{"$error":"#N/A"}]
[-91,{"$f":"(C67>0)*(COUNTIF(C$4:C67,\">0\")+100*(C67=2))","v":0},0,null,null,64,null,null,null,null,null,null,null,null,null,null,null,null,null,64,{"$error":"#N/A"},{"$error":"#N/A"},{"$error":"#N/A"},{"$error":"#N/A"}]
[-91,{"$f":"(C68>0)*(COUNTIF(C$4:C68,\">0\")+100*(C68=2))","v":0},0,null,null,65,null,null,null,null,null,null,null,null,null,null,null,null,null,65,{"$f":"VLOOKUP(U$2&$T68,$D$4:$R$103,5,FALSE)","v":{"$error":"#N/A"}},{"$f":"VLOOKUP(U$2&$T68,$E$4:$R$103,4,FALSE)","v":{"$error":"#N/A"}},{"$f":"VLOOKUP(W$2&$T68,$D$4:$R$103,5,FALSE)","v":{"$error":"#N/A"}},{"$f":"VLOOKUP(W$2&$T68,$E$4:$R$103,4,FALSE)","v":{"$error":"#N/A"}}]
[{"$f":"RANK(B69,$B$4:$B$103,1)-A$2","v":-91},{"$f":"(C69>0)*(COUNTIF(C$4:C69,\">0\")+100*(C69=2))","v":0},{"$f":"IF(O69&P69=\"\",0,K69)","v":0},null,null,66,null,null,null,null,null,null,null,null,null,null,null,null,null,66,{"$error":"#N/A"},{"$error":"#N/A"},{"$error":"#N/A"},{"$error":"#N/A"}]
[-91,{"$f":"(C70>0)*(COUNTIF(C$4:C70,\">0\")+100*(C70=2))","v":0},0,null,null,67,null,null,null,null,null,null,null,null,null,null,null,null,null,67,{"$error":"#N/A"},{"$error":"#N/A"},{"$error":"#N/A"},{"$error":"#N/A"}]
[-91,{"$f":"(C71>0)*(COUNTIF(C$4:C71,\">0\")+100*(C71=2))","v":0},0,null,null,68,null,null,null,null,null,null,null,null,null,null,null,null,null,68,{"$error":"#N/A"},{"$error":"#N/A"},{"$error":"#N/A"},{"$error":"#N/A"}]
[-91,{"$f":"(C72>0)*(COUNTIF(C$4:C72,\">0\")+100*(C72=2))","v":0},0,null,null,69,null,null,null,null,null,null,null,null,null,null,null,null,null,69,{"$error":"#N/A"},{"$error":"#N/A"},{"$error":"#N/A"},{"$error":"#N/A"}]
[-91,{"$f":"(C73>0)*(COUNTIF(C$4:C73,\">0\")+100*(C73=2))","v":0},0,null,null,70,null,null,null,null,null,null,null,null,null,null,null,null,null,70,{"$error":"#N/A"},{"$error":"#N/A"},{"$error":"#N/A"},{"$error":"#N/A"}]
[-91,{"$f":"(C74>0)*(COUNTIF(C$4:C74,\">0\")+100*(C74=2))","v":0},0,null,null,71,null,null,null,null,null,null,null,null,null,null,null,null,null,71,{"$error":"#N/A"},{"$error":"#N/A"},{"$error":"#N/A"},{"$error":"#N/A"}]
[-91,{"$f":"(C75>0)*(COUNTIF(C$4:C75,\">0\")+100*(C75=2))","v":0},0,null,null,72,null,null,null,null,null,null,null,null,null,null,null,null,null,72,{"$error":"#N/A"},{"$error":"#N/A"},{"$error":"#N/A"},{"$error":"#N/A"}]
[-91,{"$f":"(C76>0)*(COUNTIF(C$4:C76,\">0\")+100*(C76=2))","v":0},0,null,null,73,null,null,null,null,null,null,null,null,null,null,null,null,null,73,{"$error":"#N/A"},{"$error":"#N/A"},{"$error":"#N/A"},{"$error":"#N/A"}]
[-91,{"$f":"(C77>0)*(COUNTIF(C$4:C77,\">0\")+100*(C77=2))","v":0},0,null,null,74,null,null,null,null,null,null,null,null,null,null,null,null,null,74,{"$error":"#N/A"},{"$error":"#N/A"},{"$error":"#N/A"},{"$error":"#N/A"}]
[-91,{"$f":"(C78>0)*(COUNTIF(C$4:C78,\">0\")+100*(C78=2))","v":0},0,null,null,75,null,null,null,null,null,null,null,null,null,null,null,null,null,75,{"$error":"#N/A"},{"$error":"#N/A"},{"$error":"#N/A"},{"$error":"#N/A"}]
[-91,{"$f":"(C79>0)*(COUNTIF(C$4:C79,\">0\")+100*(C79=2))","v":0},0,null,null,76,null,null,null,null,null,null,null,null,null,null,null,null,null,76,{"$error":"#N/A"},{"$error":"#N/A"},{"$error":"#N/A"},{"$error":"#N/A"}]
[-91,{"$f":"(C80>0)*(COUNTIF(C$4:C80,\">0\")+100*(C80=2))","v":0},0,null,null,77,null,null,null,null,null,null,null,null,null,null,null,null,null,77,{"$error":"#N/A"},{"$error":"#N/A"},{"$error":"#N/A"},{"$error":"#N/A"}]
[-91,{"$f":"(C81>0)*(COUNTIF(C$4:C81,\">0\")+100*(C81=2))","v":0},0,null,null,78,null,null,null,null,null,null,null,null,null,null,null,null,null,78,{"$error":"#N/A"},{"$error":"#N/A"},{"$error":"#N/A"},{"$error":"#N/A"}]
[-91,{"$f":"(C82>0)*(COUNTIF(C$4:C82,\">0\")+100*(C82=2))","v":0},0,null,null,79,null,null,null,null,null,null,null,null,null,null,null,null,null,79,{"$error":"#N/A"},{"$error":"#N/A"},{"$error":"#N/A"},{"$error":"#N/A"}]
[-91,{"$f":"(C83>0)*(COUNTIF(C$4:C83,\">0\")+100*(C83=2))","v":0},0,null,null,80,null,null,null,null,null,null,null,null,null,null,null,null,null,80,{"$error":"#N/A"},{"$error":"#N/A"},{"$error":"#N/A"},{"$error":"#N/A"}]
[-91,{"$f":"(C84>0)*(COUNTIF(C$4:C84,\">0\")+100*(C84=2))","v":0},0,null,null,81,null,null,null,null,null,null,null,null,null,null,null,null,null,81,{"$error":"#N/A"},{"$error":"#N/A"},{"$error":"#N/A"},{"$error":"#N/A"}]
[-91,{"$f":"(C85>0)*(COUNTIF(C$4:C85,\">0\")+100*(C85=2))","v":0},0,null,null,82,null,null,null,null,null,null,null,null,null,null,null,null,null,82,{"$error":"#N/A"},{"$error":"#N/A"},{"$error":"#N/A"},{"$error":"#N/A"}]
[-91,{"$f":"(C86>0)*(COUNTIF(C$4:C86,\">0\")+100*(C86=2))","v":0},0,null,null,83,null,null,null,null,null,null,null,null,null,null,null,null,null,83,{"$error":"#N/A"},{"$error":"#N/A"},{"$error":"#N/A"},{"$error":"#N/A"}]
[-91,{"$f":"(C87>0)*(COUNTIF(C$4:C87,\">0\")+100*(C87=2))","v":0},0,null,null,84,null,null,null,null,null,null,null,null,null,null,null,null,null,84,{"$error":"#N/A"},{"$error":"#N/A"},{"$error":"#N/A"},{"$error":"#N/A"}]
[-91,{"$f":"(C88>0)*(COUNTIF(C$4:C88,\">0\")+100*(C88=2))","v":0},0,null,null,85,null,null,null,null,null,null,null,null,null,null,null,null,null,85,{"$error":"#N/A"},{"$error":"#N/A"},{"$error":"#N/A"},{"$error":"#N/A"}]
[-91,{"$f":"(C89>0)*(COUNTIF(C$4:C89,\">0\")+100*(C89=2))","v":0},0,null,null,86,null,null,null,null,null,null,null,null,null,null,null,null,null,86,{"$error":"#N/A"},{"$error":"#N/A"},{"$error":"#N/A"},{"$error":"#N/A"}]
[-91,{"$f":"(C90>0)*(COUNTIF(C$4:C90,\">0\")+100*(C90=2))","v":0},0,null,null,87,null,null,null,null,null,null,null,null,null,null,null,null,null,87,{"$error":"#N/A"},{"$error":"#N/A"},{"$error":"#N/A"},{"$error":"#N/A"}]
[-91,{"$f":"(C91>0)*(COUNTIF(C$4:C91,\">0\")+100*(C91=2))","v":0},0,null,null,88,null,null,null,null,null,null,null,null,null,null,null,null,null,88,{"$error":"#N/A"},{"$error":"#N/A"},{"$error":"#N/A"},{"$error":"#N/A"}]
[-91,{"$f":"(C92>0)*(COUNTIF(C$4:C92,\">0\")+100*(C92=2))","v":0},0,null,null,89,null,null,null,null,null,null,null,null,null,null,null,null,null,89,{"$error":"#N/A"},{"$error":"#N/A"},{"$error":"#N/A"},{"$error":"#N/A"}]
[-91,{"$f":"(C93>0)*(COUNTIF(C$4:C93,\">0\")+100*(C93=2))","v":0},0,null,null,90,null,null,null,null,null,null,null,null,null,null,null,null,null,90,{"$error":"#N/A"},{"$error":"#N/A"},{"$error":"#N/A"},{"$error":"#N/A"}]
[-91,{"$f":"(C94>0)*(COUNTIF(C$4:C94,\">0\")+100*(C94=2))","v":0},0,null,null,91,null,null,null,null,null,null,null,null,null,null,null,null,null,91,{"$error":"#N/A"},{"$error":"#N/A"},{"$error":"#N/A"},{"$error":"#N/A"}]
[-91,{"$f":"(C95>0)*(COUNTIF(C$4:C95,\">0\")+100*(C95=2))","v":0},0,null,null,92,null,null,null,null,null,null,null,null,null,null,null,null,null,92,{"$error":"#N/A"},{"$error":"#N/A"},{"$error":"#N/A"},{"$error":"#N/A"}]
[-91,{"$f":"(C96>0)*(COUNTIF(C$4:C96,\">0\")+100*(C96=2))","v":0},0,null,null,93,null,null,null,null,null,null,null,null,null,null,null,null,null,93,{"$error":"#N/A"},{"$error":"#N/A"},{"$error":"#N/A"},{"$error":"#N/A"}]
[-91,{"$f":"(C97>0)*(COUNTIF(C$4:C97,\">0\")+100*(C97=2))","v":0},0,null,null,94,null,null,null,null,null,null,null,null,null,null,null,null,null,94,{"$error":"#N/A"},{"$error":"#N/A"},{"$error":"#N/A"},{"$error":"#N/A"}]
[-91,{"$f":"(C98>0)*(COUNTIF(C$4:C98,\">0\")+100*(C98=2))","v":0},0,null,null,95,null,null,null,null,null,null,null,null,null,null,null,null,null,95,{"$error":"#N/A"},{"$error":"#N/A"},{"$error":"#N/A"},{"$error":"#N/A"}]
[-91,{"$f":"(C99>0)*(COUNTIF(C$4:C99,\">0\")+100*(C99=2))","v":0},0,null,null,96,null,null,null,null,null,null,null,null,null,null,null,null,null,96,{"$error":"#N/A"},{"$error":"#N/A"},{"$error":"#N/A"},{"$error":"#N/A"}]
[-91,{"$f":"(C100>0)*(COUNTIF(C$4:C100,\">0\")+100*(C100=2))","v":0},0,null,null,97,null,null,null,null,null,null,null,null,null,null,null,null,null,97,{"$error":"#N/A"},{"$f":"VLOOKUP(U$2&$T100,$E$4:$R$103,4,FALSE)","v":{"$error":"#N/A"}},{"$error":"#N/A"},{"$f":"VLOOKUP(W$2&$T100,$E$4:$R$103,4,FALSE)","v":{"$error":"#N/A"}}]
[-91,{"$f":"(C101>0)*(COUNTIF(C$4:C101,\">0\")+100*(C101=2))","v":0},0,null,null,98,null,null,null,null,null,null,null,null,null,null,null,null,null,98,{"$error":"#N/A"},{"$error":"#N/A"},{"$error":"#N/A"},{"$error":"#N/A"}]
[-91,{"$f":"(C102>0)*(COUNTIF(C$4:C102,\">0\")+100*(C102=2))","v":0},0,null,null,99,null,null,null,null,null,null,null,null,null,null,null,null,null,99,{"$error":"#N/A"},{"$error":"#N/A"},{"$error":"#N/A"},{"$error":"#N/A"}]
[-91,{"$f":"(C103>0)*(COUNTIF(C$4:C103,\">0\")+100*(C103=2))","v":0},0,null,null,100,null,null,null,null,null,null,null,null,null,null,null,null,null,100,{"$error":"#N/A"},{"$error":"#N/A"},{"$error":"#N/A"},{"$error":"#N/A"}]

{"sheet":"学校データ","index":3,"n_rows":24,"n_cols":5,"rows_kept":24,"cut":false,"hidden":false,"merged":[[22,0,22,1],[23,0,23,1]]}
["学校名","正式名称","連体中学校",null,"※ 黄色のセルのみ入力"]
[null,"略称","連体"]
[null,"略称フリガナ","レンタイ"]
[]
["学校所在地","〒",1234567]
[null,"住所","東京都千代田区1-1-1"]
[null,"電話","03-4567-8901"]
[]
["校長氏名",null,"中体 連"]
[]
["顧問","氏名","鋤井 小紋"]
[null,"自宅TEL","03-9876-5432"]
[null,"携帯","090-1234-5678"]
[]
["監督","氏名","鋤井 小紋"]
[null,"学校名","連体"]
[null,"携帯","090-1234-5678"]
[]
["引率者","氏名","鋤井 小紋"]
[null,"区分",null,"1: 学校職員，2: 外部指導者， 3: 保護者  （顧問が引率する場合は空欄）"]
[null,"携帯","090-1234-5678"]
[]
["中体連監督依頼報告書",null,0,"0: なし，1: あり"]
["外部指導者承認書",null,0,"0: なし，1: あり"]

{"sheet":"大会データ","index":4,"n_rows":6,"n_cols":3,"rows_kept":6,"cut":false,"hidden":false,"merged":[[5,1,5,2]]}
["実施年",2018,"年 1月"]
[]
["第",{"$f":"B1-1988","v":30},"回 東京都中学校スキー大会"]
["第",{"$f":"B3+25","v":55},"回 全国中学校スキー大会 東京都予選会"]
[]
["申込日","2017-10-17"]

{"sheet":"Manual","index":5,"n_rows":17,"n_cols":2,"rows_kept":17,"cut":false,"hidden":false,"merged":[]}
["シート名"]
[]
["大会データ","→ 黄色いセルに入力（入力済）"]
[]
["学校データ","→ 黄色いセルに入力"]
[]
["選手リスト","→ 黄色いセルに入力"]
[null,"→ ボタンを押すとまとめて印刷される"]
[]
["申込個人票 ","→ No. を入力する & 印刷 で個別印刷可能"]
[]
["申込一覧表","→ No. を入力する & 印刷 でページ毎の印刷が可能"]
[]
[]
["不明な点や不具合などがありましたら"]
["n-muramoto@th.seikei.ac.jp"]
["までご連絡下さい．"]